Reaction Details
Target5-hydroxytryptamine receptor 2A
LigandBDBM50313283
Substrate/Competitorn/a
Meas. Tech.ChEMBL_766792 (CHEMBL1827732)
Ki 0.81±n/a nM
Citation Seo, HJPark, EJKim, MJKang, SYLee, SHKim, HJLee, KNJung, MELee, MKim, MSSon, EJPark, WKKim, JLee, J Design and synthesis of novel arylpiperazine derivatives containing the imidazole core targeting 5-HT(2A) receptor and 5-HT transporter. J Med Chem54:6305-18 (2011) 
 
5-hydroxytryptamine receptor 2A
Name:5-hydroxytryptamine receptor 2A
Type:undefined
Mol. Mass.:52607.65
Organism:Homo sapiens (Human)
Description:P28223
Residue:471
BDBM50313283
NameBDBM50313283
Synonyms:1-{2-[4-(6-Fluoro-1H-indol-3-yl)-3,6-dihydro-2H-pyridin-1-yl]-ethyl}-4,5-dihydro-1H,3H-2-thia-1,2a-diaza-acenaphthylene 2,2-dioxide | CHEMBL1079460
TypeSmall organic molecule
Emp. Form.C24H25FN4O2S
Mol. Mass.452.544
SMILESFc1ccc2c(c[nH]c2c1)C1=CCN(CCN2c3cccc4CCCN(c34)S2(=O)=O)CC1