Reaction Details
TargetHepatocyte growth factor receptor
LigandBDBM50344664
Substrate/Competitorn/a
Meas. Tech.ChEMBL_766968 (CHEMBL1828295)
IC50 7200±n/a nM
Citation Kinoshita, KKobayashi, TAsoh, KFuruichi, NIto, TKawada, HHara, SOhwada, JHattori, KMiyagi, THong, WSPark, MJTakanashi, KTsukaguchi, TSakamoto, HTsukuda, TOikawa, N 9-substituted 6,6-dimethyl-11-oxo-6,11-dihydro-5H-benzo[b]carbazoles as highly selective and potent anaplastic lymphoma kinase inhibitors. J Med Chem54:6286-94 (2011) 
 
Hepatocyte growth factor receptor
Name:Hepatocyte growth factor receptor
Type:Protein
Mol. Mass.:155559.73
Organism:Homo sapiens (Human)
Description:P08581
Residue:1390
BDBM50344664
NameBDBM50344664
Synonyms:6,6-dimethyl-8-(1-(oxetan-3-yl)piperidin-4-yl)-11-oxo-6,11-dihydro-5H-benzo[b]carbazole-3-carbonitrile US9126931, 178
TypeSmall organic molecule
Emp. Form.C27H27N3O2
Mol. Mass.425.5222
SMILESCC1(C)c2[nH]c3cc(ccc3c2C(=O)c2ccc(cc12)C1CCN(CC1)C1COC1)C#N