Reaction Details
TargetNeuronal acetylcholine receptor subunit alpha-7
LigandBDBM50352786
Substrate/Competitorn/a
Meas. Tech.ChEMBL_767063 (CHEMBL1828494)
IC50>10000±n/a nM
Citation Simoni, DRondanin, RMarchetti, PRullo, CBaruchello, RGrisolia, GBarbato, GGiovannini, RMarchioro, CCapelli, AMVirginio, CBozzoli, ABorea, PAMerighi, SDonati, D Synthesis and biological activity of a novel class nicotinic acetylcholine receptors (nAChRs) ligands structurally related to anatoxin-a. Bioorg Med Chem Lett21:5423-7 (2011) 
 
Neuronal acetylcholine receptor subunit alpha-7
Name:Neuronal acetylcholine receptor subunit alpha-7
Type:n/a
Mol. Mass.:56448.33
Organism:Homo sapiens (Human)
Description: CHRNA7 (NACHRA7)
Residue:502
BDBM50352786
NameBDBM50352786
Synonyms:CHEMBL1823382
TypeSmall organic molecule
Emp. Form.C17H18N2O
Mol. Mass.266.3376
SMILESC1C[C@H]2N[C@@H]1CCC=C2c1cc(no1)-c1ccccc1