Reaction Details
TargetNeuronal acetylcholine receptor subunit alpha-7
LigandBDBM50352790
Substrate/Competitorn/a
Meas. Tech.ChEMBL_767063 (CHEMBL1828494)
IC50>10000±n/a nM
Citation Simoni, DRondanin, RMarchetti, PRullo, CBaruchello, RGrisolia, GBarbato, GGiovannini, RMarchioro, CCapelli, AMVirginio, CBozzoli, ABorea, PAMerighi, SDonati, D Synthesis and biological activity of a novel class nicotinic acetylcholine receptors (nAChRs) ligands structurally related to anatoxin-a. Bioorg Med Chem Lett21:5423-7 (2011) 
 
Neuronal acetylcholine receptor subunit alpha-7
Name:Neuronal acetylcholine receptor subunit alpha-7
Type:n/a
Mol. Mass.:56448.33
Organism:Homo sapiens (Human)
Description: CHRNA7 (NACHRA7)
Residue:502
BDBM50352790
NameBDBM50352790
Synonyms:CHEMBL1823386
TypeSmall organic molecule
Emp. Form.C10H14N2O
Mol. Mass.178.231
SMILESCc1noc2CC[C@@H]3CC[C@@H](N3)c12