Reaction Details
TargetAcetylcholine receptor subunit alpha
LigandBDBM50352786
Substrate/Competitorn/a
Meas. Tech.ChEMBL_767064 (CHEMBL1828495)
IC50 7800±n/a nM
Citation Simoni, DRondanin, RMarchetti, PRullo, CBaruchello, RGrisolia, GBarbato, GGiovannini, RMarchioro, CCapelli, AMVirginio, CBozzoli, ABorea, PAMerighi, SDonati, D Synthesis and biological activity of a novel class nicotinic acetylcholine receptors (nAChRs) ligands structurally related to anatoxin-a. Bioorg Med Chem Lett21:5423-7 (2011) 
 
Acetylcholine receptor subunit alpha
Name:Acetylcholine receptor subunit alpha
Type:Ion channel
Mol. Mass.:54542.01
Organism:Homo sapiens (Human)
Description:n/a
Residue:482
BDBM50352786
NameBDBM50352786
Synonyms:CHEMBL1823382
TypeSmall organic molecule
Emp. Form.C17H18N2O
Mol. Mass.266.3376
SMILESC1C[C@H]2N[C@@H]1CCC=C2c1cc(no1)-c1ccccc1