Reaction Details
TargetNeuraminidase
LigandBDBM50352810
Substrate/Competitorn/a
Meas. Tech.ChEMBL_767175 (CHEMBL1826421)
IC50 12300±n/a nM
Citation Park, JYJeong, HJKim, YMPark, SJRho, MCPark, KHRyu, YBLee, WS Characteristic of alkylated chalcones from Angelica keiskei on influenza virus neuraminidase inhibition. Bioorg Med Chem Lett21:5602-4 (2011) 
 
Neuraminidase
Name:Neuraminidase
Type:PROTEIN
Mol. Mass.:51401.00
Organism:Influenza A virus (strain A/Brevig Mission/1/1918 H1N1) (Influenza Avirus (strain A/South Carolina/1/1918 H1N1))
Description:ChEMBL_794312
Residue:469
BDBM50352810
NameBDBM50352810
Synonyms:CHEMBL1711961
TypeSmall organic molecule
Emp. Form.C21H22O5
Mol. Mass.354.3964
SMILESCOc1ccc(C(=O)\C=C\c2ccc(O)cc2)c(O)c1CC(O)C(C)=C