Reaction Details
TargetNeuraminidase
LigandBDBM50352808
Substrate/Competitorn/a
Meas. Tech.ChEMBL_767176 (CHEMBL1826422)
Ki 33500±n/a nM
Citation Park, JYJeong, HJKim, YMPark, SJRho, MCPark, KHRyu, YBLee, WS Characteristic of alkylated chalcones from Angelica keiskei on influenza virus neuraminidase inhibition. Bioorg Med Chem Lett21:5602-4 (2011) 
 
Neuraminidase
Name:Neuraminidase
Type:PROTEIN
Mol. Mass.:51401.00
Organism:Influenza A virus (strain A/Brevig Mission/1/1918 H1N1) (Influenza Avirus (strain A/South Carolina/1/1918 H1N1))
Description:ChEMBL_794312
Residue:469
BDBM50352808
NameBDBM50352808
Synonyms:CHEMBL1823413
TypeSmall organic molecule
Emp. Form.C24H28O6
Mol. Mass.412.4755
SMILESCOC(CC\C(C)=C\Cc1c(O)ccc(C(=O)\C=C\c2ccc(O)cc2)c1O)OC