Reaction Details
TargetNeuraminidase
LigandBDBM50352811
Substrate/Competitorn/a
Meas. Tech.ChEMBL_767176 (CHEMBL1826422)
Ki 122700±n/a nM
Citation Park, JYJeong, HJKim, YMPark, SJRho, MCPark, KHRyu, YBLee, WS Characteristic of alkylated chalcones from Angelica keiskei on influenza virus neuraminidase inhibition. Bioorg Med Chem Lett21:5602-4 (2011) 
 
Neuraminidase
Name:Neuraminidase
Type:PROTEIN
Mol. Mass.:51401.00
Organism:Influenza A virus (strain A/Brevig Mission/1/1918 H1N1) (Influenza Avirus (strain A/South Carolina/1/1918 H1N1))
Description:ChEMBL_794312
Residue:469
BDBM50352811
NameBDBM50352811
Synonyms:CHEMBL1722838
TypeSmall organic molecule
Emp. Form.C26H30O4
Mol. Mass.406.514
SMILES[#6]-[#8]-c1ccc(-[#6](=O)\[#6]=[#6]\c2ccc(-[#8])cc2)c(-[#8])c1-[#6]\[#6]=[#6](/[#6])-[#6]-[#6]\[#6]=[#6](\[#6])-[#6]