Reaction Details
TargetBeta-secretase 1
LigandBDBM50352852
Substrate/Competitorn/a
Meas. Tech.ChEMBL_767493 (CHEMBL1825605)
IC50 10±n/a nM
Citation Malamas, MSErdei, JGunawan, IBarnes, KHui, YJohnson, MRobichaud, AZhou, PYan, YSolvibile, WTurner, JFan, KYChopra, RBard, JPangalos, MN New pyrazolyl and thienyl aminohydantoins as potent BACE1 inhibitors: exploring the S2' region. Bioorg Med Chem Lett21:5164-70 (2011) 
 
Beta-secretase 1
Name:Beta-secretase 1
Type:Protein
Mol. Mass.:55755.10
Organism:Homo sapiens (Human)
Description:P56817
Residue:501
BDBM50352852
NameBDBM50352852
Synonyms:CHEMBL1824145
TypeSmall organic molecule
Emp. Form.C20H19FN6O
Mol. Mass.378.4029
SMILESCCn1cc(cn1)[C@@]1(N=C(N)N(C)C1=O)c1cccc(c1)-c1cccnc1F