Reaction Details
TargetBeta-secretase 1
LigandBDBM50352884
Substrate/Competitorn/a
Meas. Tech.ChEMBL_767496 (CHEMBL1825608)
EC50 70±n/a nM
Citation Malamas, MSErdei, JGunawan, IBarnes, KHui, YJohnson, MRobichaud, AZhou, PYan, YSolvibile, WTurner, JFan, KYChopra, RBard, JPangalos, MN New pyrazolyl and thienyl aminohydantoins as potent BACE1 inhibitors: exploring the S2' region. Bioorg Med Chem Lett21:5164-70 (2011) 
 
Beta-secretase 1
Name:Beta-secretase 1
Type:Protein
Mol. Mass.:55755.10
Organism:Homo sapiens (Human)
Description:P56817
Residue:501
BDBM50352884
NameBDBM50352884
Synonyms:CHEMBL1824353
TypeSmall organic molecule
Emp. Form.C21H19N5O2S
Mol. Mass.405.473
SMILESCCC(=O)c1cc(cs1)C1(N=C(N)N(C)C1=O)c1cccc(c1)-c1cncnc1