Reaction Details
TargetBeta-secretase 2
LigandBDBM50352863
Substrate/Competitorn/a
Meas. Tech.ChEMBL_767494 (CHEMBL1825606)
IC50 150±n/a nM
Citation Malamas, MSErdei, JGunawan, IBarnes, KHui, YJohnson, MRobichaud, AZhou, PYan, YSolvibile, WTurner, JFan, KYChopra, RBard, JPangalos, MN New pyrazolyl and thienyl aminohydantoins as potent BACE1 inhibitors: exploring the S2' region. Bioorg Med Chem Lett21:5164-70 (2011) 
 
Beta-secretase 2
Name:Beta-secretase 2
Type:Protein
Mol. Mass.:56171.20
Organism:Homo sapiens (Human)
Description:Q9Y5Z0
Residue:518
BDBM50352863
NameBDBM50352863
Synonyms:CHEMBL1824141
TypeSmall organic molecule
Emp. Form.C21H23N7O
Mol. Mass.389.4536
SMILESCCCCn1cc(cn1)C1(N=C(N)N(C)C1=O)c1cccc(c1)-c1cncnc1