Reaction Details
TargetBeta-secretase 2
LigandBDBM50352874
Substrate/Competitorn/a
Meas. Tech.ChEMBL_767494 (CHEMBL1825606)
IC50 36±n/a nM
Citation Malamas, MSErdei, JGunawan, IBarnes, KHui, YJohnson, MRobichaud, AZhou, PYan, YSolvibile, WTurner, JFan, KYChopra, RBard, JPangalos, MN New pyrazolyl and thienyl aminohydantoins as potent BACE1 inhibitors: exploring the S2' region. Bioorg Med Chem Lett21:5164-70 (2011) 
 
Beta-secretase 2
Name:Beta-secretase 2
Type:Protein
Mol. Mass.:56171.20
Organism:Homo sapiens (Human)
Description:Q9Y5Z0
Residue:518
BDBM50352874
NameBDBM50352874
Synonyms:CHEMBL1824343
TypeSmall organic molecule
Emp. Form.C24H27FN6O
Mol. Mass.434.5092
SMILESCCC(CC)Cn1cc(cn1)C1(N=C(N)N(C)C1=O)c1cccc(c1)-c1cccnc1F