Reaction Details
TargetCathepsin D
LigandBDBM50352884
Substrate/Competitorn/a
Meas. Tech.ChEMBL_767495 (CHEMBL1825607)
IC50 13050±n/a nM
Citation Malamas, MSErdei, JGunawan, IBarnes, KHui, YJohnson, MRobichaud, AZhou, PYan, YSolvibile, WTurner, JFan, KYChopra, RBard, JPangalos, MN New pyrazolyl and thienyl aminohydantoins as potent BACE1 inhibitors: exploring the S2' region. Bioorg Med Chem Lett21:5164-70 (2011) 
 
Cathepsin D
Name:Cathepsin D
Type:Enzyme
Mol. Mass.:44551.72
Organism:Homo sapiens (Human)
Description:Human proCathepsin D (SwissProt accession number P07339) was expressed in Sf9 cells, purified, and autoactivated.
Residue:412
BDBM50352884
NameBDBM50352884
Synonyms:CHEMBL1824353
TypeSmall organic molecule
Emp. Form.C21H19N5O2S
Mol. Mass.405.473
SMILESCCC(=O)c1cc(cs1)C1(N=C(N)N(C)C1=O)c1cccc(c1)-c1cncnc1