Reaction Details
TargetRenin
LigandBDBM50352969
Substrate/Competitorn/a
Meas. Tech.ChEMBL_767700 (CHEMBL1825812)
IC50 12±n/a nM
Citation Scheiper, BMatter, HSteinhagen, HBöcskei, ZFleury, VMcCort, G Structure-based optimization of potent 4- and 6-azaindole-3-carboxamides as renin inhibitors. Bioorg Med Chem Lett21:5480-6 (2011) 
 
Renin
Name:Renin
Type:Enzyme
Mol. Mass.:45058.99
Organism:Homo sapiens (Human)
Description:n/a
Residue:406
BDBM50352969
NameBDBM50352969
Synonyms:CHEMBL1824943
TypeSmall organic molecule
Emp. Form.C26H25FN4O
Mol. Mass.428.5013
SMILESCc1c(F)cccc1Cc1c(C(=O)N2CCNCC2)c2ncccc2n1-c1ccccc1