Reaction Details
TargetRenin
LigandBDBM50353002
Substrate/Competitorn/a
Meas. Tech.ChEMBL_767700 (CHEMBL1825812)
IC50 5±n/a nM
Citation Scheiper, BMatter, HSteinhagen, HBöcskei, ZFleury, VMcCort, G Structure-based optimization of potent 4- and 6-azaindole-3-carboxamides as renin inhibitors. Bioorg Med Chem Lett21:5480-6 (2011) 
 
Renin
Name:Renin
Type:Enzyme
Mol. Mass.:45058.99
Organism:Homo sapiens (Human)
Description:n/a
Residue:406
BDBM50353002
NameBDBM50353002
Synonyms:CHEMBL1825189
TypeSmall organic molecule
Emp. Form.C34H32F2N4O
Mol. Mass.550.6409
SMILESCc1c(F)cccc1Cc1c(C(=O)N2CCNCC2)c2ccnc(Cc3cccc(F)c3C)c2n1-c1ccccc1