Reaction Details
TargetCytosol aminopeptidase
LigandBDBM50353012
Substrate/Competitorn/a
Meas. Tech.ChEMBL_766294 (CHEMBL1826226)
Ki>100000±n/a nM
Citation Maiereanu, CSchmitt, CSchifano-Faux, NLe Nouën, DDefoin, ATarnus, C A novel amino-benzosuberone derivative is a picomolar inhibitor of mammalian aminopeptidase N/CD13. Bioorg Med Chem19:5716-33 (2011) 
 
Cytosol aminopeptidase
Name:Cytosol aminopeptidase
Type:Homohexamer
Mol. Mass.:56288.28
Organism:Bos taurus (bovine)
Description:Bovine kidney LAPc was purchased from Sigma Chemical Co.
Residue:519
BDBM50353012
NameBDBM50353012
Synonyms:CHEMBL1821974
TypeSmall organic molecule
Emp. Form.C11H12ClNO
Mol. Mass.209.672
SMILESNC1CCc2c(Cl)cccc2CC1=O