Reaction Details
TargetCytosol aminopeptidase
LigandBDBM50353017
Substrate/Competitorn/a
Meas. Tech.ChEMBL_766294 (CHEMBL1826226)
Ki>100000±n/a nM
Citation Maiereanu, CSchmitt, CSchifano-Faux, NLe Nouën, DDefoin, ATarnus, C A novel amino-benzosuberone derivative is a picomolar inhibitor of mammalian aminopeptidase N/CD13. Bioorg Med Chem19:5716-33 (2011) 
 
Cytosol aminopeptidase
Name:Cytosol aminopeptidase
Type:Homohexamer
Mol. Mass.:56288.28
Organism:Bos taurus (bovine)
Description:Bovine kidney LAPc was purchased from Sigma Chemical Co.
Residue:519
BDBM50353017
NameBDBM50353017
Synonyms:CHEMBL1821979
TypeSmall organic molecule
Emp. Form.C17H16BrNO
Mol. Mass.330.219
SMILESNC1CCc2c(CC1=O)c(Br)ccc2-c1ccccc1