Reaction Details
TargetCytosol aminopeptidase
LigandBDBM50353020
Substrate/Competitorn/a
Meas. Tech.ChEMBL_766294 (CHEMBL1826226)
Ki 50000±n/a nM
Citation Maiereanu, CSchmitt, CSchifano-Faux, NLe Nouën, DDefoin, ATarnus, C A novel amino-benzosuberone derivative is a picomolar inhibitor of mammalian aminopeptidase N/CD13. Bioorg Med Chem19:5716-33 (2011) 
 
Cytosol aminopeptidase
Name:Cytosol aminopeptidase
Type:Homohexamer
Mol. Mass.:56288.28
Organism:Bos taurus (bovine)
Description:Bovine kidney LAPc was purchased from Sigma Chemical Co.
Residue:519
BDBM50353020
NameBDBM50353020
Synonyms:CHEMBL1821982
TypeSmall organic molecule
Emp. Form.C23H21NO
Mol. Mass.327.4189
SMILESNC1CCc2c(CC1=O)c(ccc2-c1ccccc1)-c1ccccc1