Reaction Details
TargetAndrogen receptor
LigandBDBM50353033
Substrate/Competitorn/a
Meas. Tech.ChEMBL_766307 (CHEMBL1826239)
IC50 5900±n/a nM
Citation Axerio-Cilies, PLack, NANayana, MRChan, KHYeung, ALeblanc, EGuns, ESRennie, PSCherkasov, A Inhibitors of androgen receptor activation function-2 (AF2) site identified through virtual screening. J Med Chem54:6197-205 (2011) 
 
Androgen receptor
Name:Androgen receptor
Type:Receptor
Mol. Mass.:99185.27
Organism:Homo sapiens (Human)
Description:CHO cells were stably transfected with human AR gene.
Residue:920
BDBM50353033
NameBDBM50353033
Synonyms:CHEMBL1527972
TypeSmall organic molecule
Emp. Form.C17H14N2O
Mol. Mass.262.3059
SMILESOc1ccc(cc1)C1Nc2cccc3cccc(N1)c23