Reaction Details
TargetBeta-galactosidase
LigandBDBM50353064
Substrate/Competitorn/a
Meas. Tech.ChEMBL_767961 (CHEMBL1825290)
IC50 88600±n/a nM
Citation Burland, PAOsborn, HMTurkson, A Synthesis and glycosidase inhibitory profiles of functionalised morpholines and oxazepanes. Bioorg Med Chem19:5679-92 (2011) 
 
Beta-galactosidase
Name:Beta-galactosidase
Type:Protein
Mol. Mass.:73420.88
Organism:Bos taurus (Bovine)
Description:n/a
Residue:653
BDBM50353064
NameBDBM50353064
Synonyms:CHEMBL1822731
TypeSmall organic molecule
Emp. Form.C7H15NO3
Mol. Mass.161.1989
SMILESCO[C@@H]1CN(C)C[C@@H](CO)O1