Reaction Details
TargetBeta-galactosidase
LigandBDBM50353065
Substrate/Competitorn/a
Meas. Tech.ChEMBL_767961 (CHEMBL1825290)
IC50 75500±n/a nM
Citation Burland, PAOsborn, HMTurkson, A Synthesis and glycosidase inhibitory profiles of functionalised morpholines and oxazepanes. Bioorg Med Chem19:5679-92 (2011) 
 
Beta-galactosidase
Name:Beta-galactosidase
Type:Protein
Mol. Mass.:73420.88
Organism:Bos taurus (Bovine)
Description:n/a
Residue:653
BDBM50353065
NameBDBM50353065
Synonyms:CHEMBL1822732
TypeSmall organic molecule
Emp. Form.C9H19NO3
Mol. Mass.189.2521
SMILESCCCN1C[C@@H](CO)O[C@@H](C1)OC