Reaction Details
TargetBeta-galactosidase
LigandBDBM50353067
Substrate/Competitorn/a
Meas. Tech.ChEMBL_767961 (CHEMBL1825290)
IC50 55100±n/a nM
Citation Burland, PAOsborn, HMTurkson, A Synthesis and glycosidase inhibitory profiles of functionalised morpholines and oxazepanes. Bioorg Med Chem19:5679-92 (2011) 
 
Beta-galactosidase
Name:Beta-galactosidase
Type:Protein
Mol. Mass.:73420.88
Organism:Bos taurus (Bovine)
Description:n/a
Residue:653
BDBM50353067
NameBDBM50353067
Synonyms:CHEMBL1822734
TypeSmall organic molecule
Emp. Form.C14H29NO3
Mol. Mass.259.385
SMILESCCCCCCCCN1C[C@@H](CO)O[C@@H](C1)OC