Reaction Details
TargetBeta-galactosidase
LigandBDBM50353068
Substrate/Competitorn/a
Meas. Tech.ChEMBL_767961 (CHEMBL1825290)
Ki 20200±n/a nM
Citation Burland, PAOsborn, HMTurkson, A Synthesis and glycosidase inhibitory profiles of functionalised morpholines and oxazepanes. Bioorg Med Chem19:5679-92 (2011) 
 
Beta-galactosidase
Name:Beta-galactosidase
Type:Protein
Mol. Mass.:73420.88
Organism:Bos taurus (Bovine)
Description:n/a
Residue:653
BDBM50353068
NameBDBM50353068
Synonyms:CHEMBL1822735
TypeSmall organic molecule
Emp. Form.C6H13NO4
Mol. Mass.163.1717
SMILESCO[C@@H]1CN(O)C[C@@H](CO)O1