Reaction Details
TargetCannabinoid receptor 1
LigandBDBM50353075
Substrate/Competitorn/a
Meas. Tech.ChEMBL_767976 (CHEMBL1825305)
Ki>10000±n/a nM
Citation Turkman, NShavrin, AIvanov, RARabinovich, BVolgin, AGelovani, JGAlauddin, MM Fluorinated cannabinoid CB2 receptor ligands: synthesis and in vitro binding characteristics of 2-oxoquinoline derivatives. Bioorg Med Chem19:5698-707 (2011) 
 
Cannabinoid receptor 1
Name:Cannabinoid receptor 1
Type:G Protein-Coupled Receptor (GPCR)
Mol. Mass.:52868.96
Organism:Homo sapiens (Human)
Description:P21554
Residue:472
BDBM50353075
NameBDBM50353075
Synonyms:CHEMBL1822929
TypeSmall organic molecule
Emp. Form.C20H19FN2O4
Mol. Mass.370.3743
SMILESCOc1ccc2cc(C(=O)NCCc3ccc(F)cc3)c(=O)[nH]c2c1OC