Reaction Details
TargetCannabinoid receptor 1
LigandBDBM50353079
Substrate/Competitorn/a
Meas. Tech.ChEMBL_767976 (CHEMBL1825305)
Ki>10000±n/a nM
Citation Turkman, NShavrin, AIvanov, RARabinovich, BVolgin, AGelovani, JGAlauddin, MM Fluorinated cannabinoid CB2 receptor ligands: synthesis and in vitro binding characteristics of 2-oxoquinoline derivatives. Bioorg Med Chem19:5698-707 (2011) 
 
Cannabinoid receptor 1
Name:Cannabinoid receptor 1
Type:G Protein-Coupled Receptor (GPCR)
Mol. Mass.:52868.96
Organism:Homo sapiens (Human)
Description:P21554
Residue:472
BDBM50353079
NameBDBM50353079
Synonyms:CHEMBL1822933
TypeSmall organic molecule
Emp. Form.C23H24FN3O6
Mol. Mass.457.4516
SMILESCCCCOc1c(OC)c(cc2cc(C(=O)NCCc3ccc(F)cc3)c(=O)[nH]c12)[N+]([O-])=O