Reaction Details
TargetCannabinoid receptor 2
LigandBDBM50353074
Substrate/Competitorn/a
Meas. Tech.ChEMBL_767977 (CHEMBL1825306)
Ki 2.8±n/a nM
Citation Turkman, NShavrin, AIvanov, RARabinovich, BVolgin, AGelovani, JGAlauddin, MM Fluorinated cannabinoid CB2 receptor ligands: synthesis and in vitro binding characteristics of 2-oxoquinoline derivatives. Bioorg Med Chem19:5698-707 (2011) 
 
Cannabinoid receptor 2
Name:Cannabinoid receptor 2
Type:G Protein-Coupled Receptor (GPCR)
Mol. Mass.:39690.94
Organism:Homo sapiens (Human)
Description:P34972
Residue:360
BDBM50353074
NameBDBM50353074
Synonyms:CHEMBL1822928
TypeSmall organic molecule
Emp. Form.C22H23FN2O4
Mol. Mass.398.4274
SMILESCCCCOc1c(OC)ccc2cc(C(=O)NCc3ccc(F)cc3)c(=O)[nH]c12