Reaction Details
TargetCannabinoid receptor 2
LigandBDBM50353075
Substrate/Competitorn/a
Meas. Tech.ChEMBL_767977 (CHEMBL1825306)
Ki 5±n/a nM
Citation Turkman, NShavrin, AIvanov, RARabinovich, BVolgin, AGelovani, JGAlauddin, MM Fluorinated cannabinoid CB2 receptor ligands: synthesis and in vitro binding characteristics of 2-oxoquinoline derivatives. Bioorg Med Chem19:5698-707 (2011) 
 
Cannabinoid receptor 2
Name:Cannabinoid receptor 2
Type:G Protein-Coupled Receptor (GPCR)
Mol. Mass.:39690.94
Organism:Homo sapiens (Human)
Description:P34972
Residue:360
BDBM50353075
NameBDBM50353075
Synonyms:CHEMBL1822929
TypeSmall organic molecule
Emp. Form.C20H19FN2O4
Mol. Mass.370.3743
SMILESCOc1ccc2cc(C(=O)NCCc3ccc(F)cc3)c(=O)[nH]c2c1OC