Reaction Details
TargetCannabinoid receptor 2
LigandBDBM50353079
Substrate/Competitorn/a
Meas. Tech.ChEMBL_767977 (CHEMBL1825306)
Ki 1.4±n/a nM
Citation Turkman, NShavrin, AIvanov, RARabinovich, BVolgin, AGelovani, JGAlauddin, MM Fluorinated cannabinoid CB2 receptor ligands: synthesis and in vitro binding characteristics of 2-oxoquinoline derivatives. Bioorg Med Chem19:5698-707 (2011) 
 
Cannabinoid receptor 2
Name:Cannabinoid receptor 2
Type:G Protein-Coupled Receptor (GPCR)
Mol. Mass.:39690.94
Organism:Homo sapiens (Human)
Description:P34972
Residue:360
BDBM50353079
NameBDBM50353079
Synonyms:CHEMBL1822933
TypeSmall organic molecule
Emp. Form.C23H24FN3O6
Mol. Mass.457.4516
SMILESCCCCOc1c(OC)c(cc2cc(C(=O)NCCc3ccc(F)cc3)c(=O)[nH]c12)[N+]([O-])=O