Reaction Details
TargetCannabinoid receptor 1
LigandBDBM50353085
Substrate/Competitorn/a
Meas. Tech.ChEMBL_767974 (CHEMBL1825303)
Ki 5055±n/a nM
Citation Turkman, NShavrin, AIvanov, RARabinovich, BVolgin, AGelovani, JGAlauddin, MM Fluorinated cannabinoid CB2 receptor ligands: synthesis and in vitro binding characteristics of 2-oxoquinoline derivatives. Bioorg Med Chem19:5698-707 (2011) 
 
Cannabinoid receptor 1
Name:Cannabinoid receptor 1
Type:G Protein-Coupled Receptor (GPCR)
Mol. Mass.:52868.96
Organism:Homo sapiens (Human)
Description:P21554
Residue:472
BDBM50353085
NameBDBM50353085
Synonyms:CHEMBL1822926
TypeSmall organic molecule
Emp. Form.C24H40O3
Mol. Mass.376.5726
SMILESCCCCCCC(C)(C)c1cc(OC)c(C2CCCC(C)(O)C2)c(OC)c1