Reaction Details
TargetCannabinoid receptor 2
LigandBDBM50353085
Substrate/Competitorn/a
Meas. Tech.ChEMBL_767975 (CHEMBL1825304)
Ki 23±n/a nM
Citation Turkman, NShavrin, AIvanov, RARabinovich, BVolgin, AGelovani, JGAlauddin, MM Fluorinated cannabinoid CB2 receptor ligands: synthesis and in vitro binding characteristics of 2-oxoquinoline derivatives. Bioorg Med Chem19:5698-707 (2011) 
 
Cannabinoid receptor 2
Name:Cannabinoid receptor 2
Type:G Protein-Coupled Receptor (GPCR)
Mol. Mass.:39690.94
Organism:Homo sapiens (Human)
Description:P34972
Residue:360
BDBM50353085
NameBDBM50353085
Synonyms:CHEMBL1822926
TypeSmall organic molecule
Emp. Form.C24H40O3
Mol. Mass.376.5726
SMILESCCCCCCC(C)(C)c1cc(OC)c(C2CCCC(C)(O)C2)c(OC)c1