Reaction Details
TargetCannabinoid receptor 2
LigandBDBM50353090
Substrate/Competitorn/a
Meas. Tech.ChEMBL_767975 (CHEMBL1825304)
Ki 0.085±n/a nM
Citation Turkman, NShavrin, AIvanov, RARabinovich, BVolgin, AGelovani, JGAlauddin, MM Fluorinated cannabinoid CB2 receptor ligands: synthesis and in vitro binding characteristics of 2-oxoquinoline derivatives. Bioorg Med Chem19:5698-707 (2011) 
 
Cannabinoid receptor 2
Name:Cannabinoid receptor 2
Type:G Protein-Coupled Receptor (GPCR)
Mol. Mass.:39690.94
Organism:Homo sapiens (Human)
Description:P34972
Residue:360
BDBM50353090
NameBDBM50353090
Synonyms:CHEMBL1822943
TypeSmall organic molecule
Emp. Form.C23H33N3O5
Mol. Mass.431.5252
SMILESCCCCCOc1c(OC)ccc2cc(C(=O)NCCN3CCOCC3)c(=O)n(C)c12