Reaction Details
TargetSodium/hydrogen exchanger 1
LigandBDBM50353115
Substrate/Competitorn/a
Meas. Tech.ChEMBL_768436 (CHEMBL1832155)
IC50 0.068±n/a nM
Citation Jin, LJiang, XMDu, PXu, JGong, GQWang, QJXu, YG Synthesis and Na+/H+ exchanger inhibitory activity of benzoylguanidine derivatives. Eur J Med Chem46:4107-16 (2011) 
 
Sodium/hydrogen exchanger 1
Name:Sodium/hydrogen exchanger 1
Type:PROTEIN
Mol. Mass.:91655.00
Organism:Rattus norvegicus
Description:ChEMBL_862370
Residue:820
BDBM50353115
NameBDBM50353115
Synonyms:CHEMBL1829127
TypeSmall organic molecule
Emp. Form.C30H38N6O6S
Mol. Mass.610.724
SMILESCOc1ccc(CN2CCN(CCOc3ccc(cc3NC(=O)c3sccc3C)C(=O)NC(N)=N)CC2)c(OC)c1OC