Reaction Details
TargetHistone-lysine N-methyltransferase EHMT2
LigandBDBM50353120
Substrate/Competitorn/a
Meas. Tech.ChEMBL_768501 (CHEMBL1832324)
IC50 470±n/a nM
Citation Liu, FBarsyte-Lovejoy, DAllali-Hassani, AHe, YHerold, JMChen, XYates, CMFrye, SVBrown, PJHuang, JVedadi, MArrowsmith, CHJin, J Optimization of cellular activity of G9a inhibitors 7-aminoalkoxy-quinazolines. J Med Chem54:6139-50 (2011) 
 
Histone-lysine N-methyltransferase EHMT2
Name:Histone-lysine N-methyltransferase EHMT2
Type:Enzyme
Mol. Mass.:132339.87
Organism:Homo sapiens (Human)
Description:Q96KQ7
Residue:1210
BDBM50353120
NameBDBM50353120
Synonyms:CHEMBL1829294
TypeSmall organic molecule
Emp. Form.C31H51N7O2
Mol. Mass.553.7823
SMILESCCN1CCCN(CC1)c1nc(NC2CCN(CC2)C(C)C)c2cc(OC)c(OCCCN3CCCC3)cc2n1