Reaction Details
TargetHistone-lysine N-methyltransferase EHMT2
LigandBDBM50353121
Substrate/Competitorn/a
Meas. Tech.ChEMBL_768501 (CHEMBL1832324)
IC50 340±n/a nM
Citation Liu, FBarsyte-Lovejoy, DAllali-Hassani, AHe, YHerold, JMChen, XYates, CMFrye, SVBrown, PJHuang, JVedadi, MArrowsmith, CHJin, J Optimization of cellular activity of G9a inhibitors 7-aminoalkoxy-quinazolines. J Med Chem54:6139-50 (2011) 
 
Histone-lysine N-methyltransferase EHMT2
Name:Histone-lysine N-methyltransferase EHMT2
Type:Enzyme
Mol. Mass.:132339.87
Organism:Homo sapiens (Human)
Description:Q96KQ7
Residue:1210
BDBM50353121
NameBDBM50353121
Synonyms:CHEMBL1829295
TypeSmall organic molecule
Emp. Form.C32H53N7O2
Mol. Mass.567.8089
SMILESCOc1cc2c(NC3CCN(CC3)C(C)C)nc(nc2cc1OCCCN1CCCC1)N1CCCN(CC1)C(C)C