Reaction Details
TargetHistone deacetylase 5
LigandBDBM25150
Substrate/Competitorn/a
Meas. Tech.ChEMBL_769061 (CHEMBL1832524)
Ki 25±n/a nM
Citation Wang, HYu, NChen, DLee, KCLye, PLChang, JWDeng, WNg, MCLu, TKhoo, MLPoulsen, ASangthongpitag, KWu, XHu, CGoh, KCWang, XFang, LGoh, KLKhng, HHGoh, SKYeo, PLiu, XBonday, ZWood, JMDymock, BWKantharaj, ESun, ET Discovery of (2E)-3-{2-butyl-1-[2-(diethylamino)ethyl]-1H-benzimidazol-5-yl}-N-hydroxyacrylamide (SB939), an orally active histone deacetylase inhibitor with a superior preclinical profile. J Med Chem54:4694-720 (2011) 
 
Histone deacetylase 5
Name:Histone deacetylase 5
Type:Enzyme
Mol. Mass.:121968.61
Organism:Homo sapiens (Human)
Description:Q9UQL6
Residue:1122
BDBM25150
NameBDBM25150
Synonyms:(2E)-N-hydroxy-3-[3-(phenylsulfamoyl)phenyl]prop-2-enamide Belinostat PXD101
TypeSmall organic molecule
Emp. Form.C15H14N2O4S
Mol. Mass.318.348
SMILESONC(=O)\C=C\c1cccc(c1)S(=O)(=O)Nc1ccccc1