Reaction Details
TargetHistone deacetylase 7
LigandBDBM50353231
Substrate/Competitorn/a
Meas. Tech.ChEMBL_769063 (CHEMBL1832526)
Ki 41±n/a nM
Citation Wang, HYu, NChen, DLee, KCLye, PLChang, JWDeng, WNg, MCLu, TKhoo, MLPoulsen, ASangthongpitag, KWu, XHu, CGoh, KCWang, XFang, LGoh, KLKhng, HHGoh, SKYeo, PLiu, XBonday, ZWood, JMDymock, BWKantharaj, ESun, ET Discovery of (2E)-3-{2-butyl-1-[2-(diethylamino)ethyl]-1H-benzimidazol-5-yl}-N-hydroxyacrylamide (SB939), an orally active histone deacetylase inhibitor with a superior preclinical profile. J Med Chem54:4694-720 (2011) 
 
Histone deacetylase 7
Name:Histone deacetylase 7
Type:Chromatin regulator; hydrolase; repressor
Mol. Mass.:102942.62
Organism:Homo sapiens (Human)
Description:Q8WUI4
Residue:952
BDBM50353231
NameBDBM50353231
Synonyms:CHEMBL1830422
TypeSmall organic molecule
Emp. Form.C21H32N4O2
Mol. Mass.372.5044
SMILESCCCCCCc1nc2cc(\C=C\C(=O)NO)ccc2n1CCNC(C)C