Reaction Details
TargetHistone deacetylase 9
LigandBDBM50353228
Substrate/Competitorn/a
Meas. Tech.ChEMBL_769065 (CHEMBL1832528)
Ki 30±n/a nM
Citation Wang, HYu, NChen, DLee, KCLye, PLChang, JWDeng, WNg, MCLu, TKhoo, MLPoulsen, ASangthongpitag, KWu, XHu, CGoh, KCWang, XFang, LGoh, KLKhng, HHGoh, SKYeo, PLiu, XBonday, ZWood, JMDymock, BWKantharaj, ESun, ET Discovery of (2E)-3-{2-butyl-1-[2-(diethylamino)ethyl]-1H-benzimidazol-5-yl}-N-hydroxyacrylamide (SB939), an orally active histone deacetylase inhibitor with a superior preclinical profile. J Med Chem54:4694-720 (2011) 
 
Histone deacetylase 9
Name:Histone deacetylase 9
Type:Enzyme
Mol. Mass.:111304.31
Organism:Homo sapiens (Human)
Description:Q9UKV0
Residue:1011
BDBM50353228
NameBDBM50353228
Synonyms:CHEMBL1830396
TypeSmall organic molecule
Emp. Form.C19H28N4O2
Mol. Mass.344.4512
SMILESCCCCc1nc2cc(\C=C\C(=O)NO)ccc2n1CCNC(C)C