Reaction Details
TargetHistone deacetylase 11
LigandBDBM50248570
Substrate/Competitorn/a
Meas. Tech.ChEMBL_769067 (CHEMBL1832530)
Ki 16±n/a nM
Citation Wang, HYu, NChen, DLee, KCLye, PLChang, JWDeng, WNg, MCLu, TKhoo, MLPoulsen, ASangthongpitag, KWu, XHu, CGoh, KCWang, XFang, LGoh, KLKhng, HHGoh, SKYeo, PLiu, XBonday, ZWood, JMDymock, BWKantharaj, ESun, ET Discovery of (2E)-3-{2-butyl-1-[2-(diethylamino)ethyl]-1H-benzimidazol-5-yl}-N-hydroxyacrylamide (SB939), an orally active histone deacetylase inhibitor with a superior preclinical profile. J Med Chem54:4694-720 (2011) 
 
Histone deacetylase 11
Name:Histone deacetylase 11
Type:Chromatin regulator; hydrolase; repressor
Mol. Mass.:39187.66
Organism:Homo sapiens (Human)
Description:Q96DB2
Residue:347
BDBM50248570
NameBDBM50248570
Synonyms:3-(1-(3-(dimethylamino)-2,2-dimethylpropyl)-2-phenethyl-1H-benzo[d]imidazol-5-yl)-N-hydroxyacrylamide US10201527, Compound 17 US8551988, 17
TypeSmall organic molecule
Emp. Form.C25H32N4O2
Mol. Mass.420.5472
SMILESCN(C)CC(C)(C)Cn1c(CCc2ccccc2)nc2cc(\C=C\C(=O)NO)ccc12