Reaction Details
TargetHistone deacetylase 11
LigandBDBM50353234
Substrate/Competitorn/a
Meas. Tech.ChEMBL_769067 (CHEMBL1832530)
Ki 4.2±n/a nM
Citation Wang, HYu, NChen, DLee, KCLye, PLChang, JWDeng, WNg, MCLu, TKhoo, MLPoulsen, ASangthongpitag, KWu, XHu, CGoh, KCWang, XFang, LGoh, KLKhng, HHGoh, SKYeo, PLiu, XBonday, ZWood, JMDymock, BWKantharaj, ESun, ET Discovery of (2E)-3-{2-butyl-1-[2-(diethylamino)ethyl]-1H-benzimidazol-5-yl}-N-hydroxyacrylamide (SB939), an orally active histone deacetylase inhibitor with a superior preclinical profile. J Med Chem54:4694-720 (2011) 
 
Histone deacetylase 11
Name:Histone deacetylase 11
Type:Chromatin regulator; hydrolase; repressor
Mol. Mass.:39187.66
Organism:Homo sapiens (Human)
Description:Q96DB2
Residue:347
BDBM50353234
NameBDBM50353234
Synonyms:CHEMBL1830537
TypeSmall organic molecule
Emp. Form.C20H30N4O2
Mol. Mass.358.4778
SMILESCCCCCc1nc2cc(\C=C\C(=O)NO)ccc2n1CCNC(C)C