Reaction Details
TargetHistone deacetylase 3
LigandBDBM50248570
Substrate/Competitorn/a
Meas. Tech.ChEMBL_769059 (CHEMBL1832522)
Ki 11±n/a nM
Citation Wang, HYu, NChen, DLee, KCLye, PLChang, JWDeng, WNg, MCLu, TKhoo, MLPoulsen, ASangthongpitag, KWu, XHu, CGoh, KCWang, XFang, LGoh, KLKhng, HHGoh, SKYeo, PLiu, XBonday, ZWood, JMDymock, BWKantharaj, ESun, ET Discovery of (2E)-3-{2-butyl-1-[2-(diethylamino)ethyl]-1H-benzimidazol-5-yl}-N-hydroxyacrylamide (SB939), an orally active histone deacetylase inhibitor with a superior preclinical profile. J Med Chem54:4694-720 (2011) 
 
Histone deacetylase 3
Name:Histone deacetylase 3
Type:Enzyme
Mol. Mass.:48829.55
Organism:Homo sapiens (Human)
Description:O15379
Residue:428
BDBM50248570
NameBDBM50248570
Synonyms:3-(1-(3-(dimethylamino)-2,2-dimethylpropyl)-2-phenethyl-1H-benzo[d]imidazol-5-yl)-N-hydroxyacrylamide US10201527, Compound 17 US8551988, 17
TypeSmall organic molecule
Emp. Form.C25H32N4O2
Mol. Mass.420.5472
SMILESCN(C)CC(C)(C)Cn1c(CCc2ccccc2)nc2cc(\C=C\C(=O)NO)ccc12