Reaction Details
TargetCytochrome P450 26A1
LigandBDBM50176808
Substrate/Competitorn/a
Meas. Tech.ChEMBL_769532 (CHEMBL1833279)
IC50 540±n/a nM
Citation Gomaa, MSBridgens, CEVeal, GJRedfern, CPBrancale, AArmstrong, JLSimons, C Synthesis and biological evaluation of 3-(1H-imidazol- and triazol-1-yl)-2,2-dimethyl-3-[4-(naphthalen-2-ylamino)phenyl]propyl derivatives as small molecule inhibitors of retinoic acid 4-hydroxylase (CYP26). J Med Chem54:6803-11 (2011) 
 
Cytochrome P450 26A1
Name:Cytochrome P450 26A1
Type:Enzyme
Mol. Mass.:56216.16
Organism:Homo sapiens (Human)
Description:O43174
Residue:497
BDBM50176808
NameBDBM50176808
Synonyms:5-[(3-Chloro-phenyl)-imidazol-1-yl-methyl]-1H-benzoimidazole CHEMBL389433 US9144538, Liarizole hydrochloride | liarozole
TypeSmall organic molecule
Emp. Form.C17H13ClN4
Mol. Mass.308.765
SMILESClc1cccc(c1)C(c1ccc2nc[nH]c2c1)n1ccnc1