Reaction Details
TargetCytochrome P450 1A2
LigandBDBM50342133
Substrate/Competitorn/a
Meas. Tech.ChEMBL_769540 (CHEMBL1833287)
IC50 8300±n/a nM
Citation Gomaa, MSBridgens, CEVeal, GJRedfern, CPBrancale, AArmstrong, JLSimons, C Synthesis and biological evaluation of 3-(1H-imidazol- and triazol-1-yl)-2,2-dimethyl-3-[4-(naphthalen-2-ylamino)phenyl]propyl derivatives as small molecule inhibitors of retinoic acid 4-hydroxylase (CYP26). J Med Chem54:6803-11 (2011) 
 
Cytochrome P450 1A2
Name:Cytochrome P450 1A2
Type:Enzyme
Mol. Mass.:58423.38
Organism:Homo sapiens (Human)
Description:P05177
Residue:516
BDBM50342133
NameBDBM50342133
Synonyms:Benzothiazol-2-yl-[4-((1S,2S)-2-dimethylamino-1-imidazol-1-yl-propyl)-phenyl]-amine N-(4-((1R,2R)-2-(dimethylamino)-1-(1H-imidazol-1-yl)propyl)phenyl)benzo[d]thiazol-2-amine | R-116010
TypeSmall organic molecule
Emp. Form.C21H23N5S
Mol. Mass.377.506
SMILESC[C@H]([C@@H](c1ccc(Nc2nc3ccccc3s2)cc1)n1ccnc1)N(C)C