Reaction Details
TargetCytochrome P450 2C9
LigandBDBM50342128
Substrate/Competitorn/a
Meas. Tech.ChEMBL_769542 (CHEMBL1833289)
IC50 8000±n/a nM
Citation Gomaa, MSBridgens, CEVeal, GJRedfern, CPBrancale, AArmstrong, JLSimons, C Synthesis and biological evaluation of 3-(1H-imidazol- and triazol-1-yl)-2,2-dimethyl-3-[4-(naphthalen-2-ylamino)phenyl]propyl derivatives as small molecule inhibitors of retinoic acid 4-hydroxylase (CYP26). J Med Chem54:6803-11 (2011) 
 
Cytochrome P450 2C9
Name:Cytochrome P450 2C9
Type:Enzyme
Mol. Mass.:55636.33
Organism:Homo sapiens (Human)
Description:P11712
Residue:490
BDBM50342128
NameBDBM50342128
Synonyms:3-Imidazol-1-yl-2-methyl-3-[4-(naphthalen-2-ylamino)-phenyl]-propionicAcid Methyl Ester | CHEMBL1766005
TypeSmall organic molecule
Emp. Form.C25H25N3O2
Mol. Mass.399.4849
SMILESCOC(=O)C(C)(C)C(c1ccc(Nc2ccc3ccccc3c2)cc1)n1ccnc1