Reaction Details
TargetCytochrome P450 2C19
LigandBDBM50353578
Substrate/Competitorn/a
Meas. Tech.ChEMBL_769611 (CHEMBL1833544)
IC50 3140±n/a nM
Citation Gomaa, MSBridgens, CEVeal, GJRedfern, CPBrancale, AArmstrong, JLSimons, C Synthesis and biological evaluation of 3-(1H-imidazol- and triazol-1-yl)-2,2-dimethyl-3-[4-(naphthalen-2-ylamino)phenyl]propyl derivatives as small molecule inhibitors of retinoic acid 4-hydroxylase (CYP26). J Med Chem54:6803-11 (2011) 
 
Cytochrome P450 2C19
Name:Cytochrome P450 2C19
Type:Enzyme
Mol. Mass.:55935.47
Organism:Homo sapiens (Human)
Description:P33261
Residue:490
BDBM50353578
NameBDBM50353578
Synonyms:CHEMBL1831092
TypeSmall organic molecule
Emp. Form.C24H24N4O2
Mol. Mass.400.473
SMILESCOC(=O)C(C)(C)C(c1ccc(Nc2ccc3ccccc3c2)cc1)n1cncn1