Reaction Details
TargetCytochrome P450 26A1
LigandBDBM50253770
Substrate/Competitorn/a
Meas. Tech.ChEMBL_769532 (CHEMBL1833279)
IC50 500±n/a nM
Citation Gomaa, MSBridgens, CEVeal, GJRedfern, CPBrancale, AArmstrong, JLSimons, C Synthesis and biological evaluation of 3-(1H-imidazol- and triazol-1-yl)-2,2-dimethyl-3-[4-(naphthalen-2-ylamino)phenyl]propyl derivatives as small molecule inhibitors of retinoic acid 4-hydroxylase (CYP26). J Med Chem54:6803-11 (2011) 
 
Cytochrome P450 26A1
Name:Cytochrome P450 26A1
Type:Enzyme
Mol. Mass.:56216.16
Organism:Homo sapiens (Human)
Description:O43174
Residue:497
BDBM50253770
NameBDBM50253770
Synonyms:CHEMBL518482 | [4-(Imidazol-1-yl-phenyl-methyl)-phenyl]-naphthalen-2-yl-amine
TypeSmall organic molecule
Emp. Form.C26H21N3
Mol. Mass.375.465
SMILESN(c1ccc(cc1)C(c1ccccc1)n1ccnc1)c1ccc2ccccc2c1