Reaction Details
TargetATP-dependent translocase ABCB1
LigandBDBM50353601
Substrate/Competitorn/a
Meas. Tech.ChEMBL_769544 (CHEMBL1833291)
Ki 510±n/a nM
Citation Perestelo, NRSánchez-Cañete, MPGamarro, FJiménez, IACastanys, SBazzocchi, IL Overcoming human P-glycoprotein-dependent multidrug resistance with novel dihydro-ß-agarofuran sesquiterpenes. Eur J Med Chem46:4915-23 (2011) 
 
ATP-dependent translocase ABCB1
Name:ATP-dependent translocase ABCB1
Type:Protein
Mol. Mass.:141503.50
Organism:Homo sapiens (Human)
Description:P08183
Residue:1280
BDBM50353601
NameBDBM50353601
Synonyms:CHEMBL1829521
TypeSmall organic molecule
Emp. Form.C31H36O14
Mol. Mass.632.6091
SMILESCC(=O)OC[C@]12[C@H](C[C@@H]3[C@@H](OC(=O)c4ccoc4)[C@]1(OC3(C)C)[C@@](C)(O)C[C@H](OC(C)=O)[C@@H]2OC(C)=O)OC(=O)c1ccoc1