Reaction Details
TargetATP-dependent translocase ABCB1
LigandBDBM50353602
Substrate/Competitorn/a
Meas. Tech.ChEMBL_769544 (CHEMBL1833291)
Ki 380±n/a nM
Citation Perestelo, NRSánchez-Cañete, MPGamarro, FJiménez, IACastanys, SBazzocchi, IL Overcoming human P-glycoprotein-dependent multidrug resistance with novel dihydro-ß-agarofuran sesquiterpenes. Eur J Med Chem46:4915-23 (2011) 
 
ATP-dependent translocase ABCB1
Name:ATP-dependent translocase ABCB1
Type:Protein
Mol. Mass.:141503.50
Organism:Homo sapiens (Human)
Description:P08183
Residue:1280
BDBM50353602
NameBDBM50353602
Synonyms:CHEMBL1829522
TypeSmall organic molecule
Emp. Form.C36H38O11
Mol. Mass.646.6803
SMILESCC(=O)O[C@H]1[C@H](C[C@](C)(O)[C@]23OC(C)(C)[C@H](C[C@H](OC(=O)c4ccoc4)[C@]12C)[C@H]3OC(=O)c1ccccc1)OC(=O)c1ccccc1