Reaction Details
TargetThromboxane A2 receptor
LigandBDBM50353640
Substrate/Competitorn/a
Meas. Tech.ChEMBL_769810 (CHEMBL1831674)
IC50 27±n/a nM
Citation Ballatore, CSoper, JHPiscitelli, FJames, MHuang, LAtasoylu, OHuryn, DMTrojanowski, JQLee, VMBrunden, KRSmith, AB Cyclopentane-1,3-dione: a novel isostere for the carboxylic acid functional group. Application to the design of potent thromboxane (A2) receptor antagonists. J Med Chem54:6969-83 (2011) 
 
Thromboxane A2 receptor
Name:Thromboxane A2 receptor
Type:Enzyme Catalytic Domain
Mol. Mass.:37114.77
Organism:MOUSE
Description:Thromboxane A2 TBXA2R MOUSE::P30987
Residue:341
BDBM50353640
NameBDBM50353640
Synonyms:CHEMBL65121
TypeSmall organic molecule
Emp. Form.C17H18ClNO4S
Mol. Mass.367.847
SMILESOC(=O)CCc1cccc(CCNS(=O)(=O)c2ccc(Cl)cc2)c1