Reaction Details
TargetMu-type opioid receptor
LigandBDBM50353656
Substrate/Competitorn/a
Meas. Tech.ChEMBL_770074 (CHEMBL1832554)
Ki 2600±n/a nM
Citation Malinka, WRedzicka, AJastrzebska-Wiesek, MFilipek, BDybala, MKarczmarzyk, ZUrbanczyk-Lipkowska, ZKalicki, P Derivatives of pyrrolo[3,4-d]pyridazinone, a new class of analgesic agents. Eur J Med Chem46:4992-9 (2011) 
 
Mu-type opioid receptor
Name:Mu-type opioid receptor
Type:G Protein-Coupled Receptor (GPCR)
Mol. Mass.:44503.11
Organism:Rattus norvegicus (rat)
Description:Competition binding assays were carried out using membrane preparations from transfected HN9.10 cells that constitutively expressed the mu opioid receptor.
Residue:398
BDBM50353656
NameBDBM50353656
Synonyms:CHEMBL1829950
TypeSmall organic molecule
Emp. Form.C27H30ClN5O2
Mol. Mass.492.012
SMILESCc1n(c(C)c2c1c(=O)[nH]n(CCN1CCN(CC1)c1cc(Cl)ccc1C)c2=O)-c1ccccc1