Reaction Details
TargetMu-type opioid receptor
LigandBDBM50353657
Substrate/Competitorn/a
Meas. Tech.ChEMBL_770074 (CHEMBL1832554)
Ki 11100±n/a nM
Citation Malinka, WRedzicka, AJastrzebska-Wiesek, MFilipek, BDybala, MKarczmarzyk, ZUrbanczyk-Lipkowska, ZKalicki, P Derivatives of pyrrolo[3,4-d]pyridazinone, a new class of analgesic agents. Eur J Med Chem46:4992-9 (2011) 
 
Mu-type opioid receptor
Name:Mu-type opioid receptor
Type:G Protein-Coupled Receptor (GPCR)
Mol. Mass.:44503.11
Organism:Rattus norvegicus (rat)
Description:Competition binding assays were carried out using membrane preparations from transfected HN9.10 cells that constitutively expressed the mu opioid receptor.
Residue:398
BDBM50353657
NameBDBM50353657
Synonyms:CHEMBL1829947
TypeSmall organic molecule
Emp. Form.C26H28FN5O2
Mol. Mass.461.5312
SMILESCc1n(c(C)c2c1c(=O)[nH]n(CCN1CCN(CC1)c1ccccc1F)c2=O)-c1ccccc1